problem installing zmq, error in make check: lt-test_last_endpoint: test_last_endpoint.cpp

Description

I try to install zmq in Linux 2.6.18-348.3.1.el5, using compiler gcc 4.2.3 64 bit, at the last phase, when I execute the cmd "make check", I am getting the error:

PASS: test_msg_flags
test_connect_resolve running...
PASS: test_connect_resolve
test_connect_delay running...
Rerunning with DELAY_ATTACH_ON_CONNECT
Running DELAY_ATTACH_ON_CONNECT with disconnect
PASS: test_connect_delay
lt-test_last_endpoint: test_last_endpoint.cpp:31: void do_bind_and_verify(void*, const char*): Assertion `rc == 0' failed.
/bin/sh: line 5: 17505 Aborted ${dir}$tst
FAIL: test_last_endpoint
unbind endpoint test running...
disconnect endpoint test running...
PASS: test_term_endpoint
PASS: test_monitor
test_router_mandatory running...
PASS: test_router_mandatory
subscribing on 'foo'
received on subscriber 'foo'
received on subscriber 'this is foo!'
received on subscriber 'foo'
received on subscriber 'this is foo!'
received on subscriber 'foo'
received on subscriber 'this is foo!'
unsubscribing from 'foo'
PASS: test_disconnect_inproc
test_shutdown_stress running...
PASS: test_shutdown_stress
test_pair_ipc running...
PASS: test_pair_ipc
test_reqrep_ipc running...
PASS: test_reqrep_ipc
test_timeo running...
PASS: test_timeo
============================================
1 of 20 tests failed
Please report to zeromq-dev@lists.zeromq.org
============================================
make[2]: *** [check-TESTS] Error 1
make[2]: Leaving directory `/home/nyeartd/cpkgs/zeromq/3.2.3/zeromq-3.2.3/tests'
make[1]: *** [check-am] Error 2
make[1]: Leaving directory `/home/nyeartd/cpkgs/zeromq/3.2.3/zeromq-3.2.3/tests'
make: *** [check-recursive] Error 1

Environment

Linux 2.6.18-348.3.1.el5, compiler gcc 4.2.3 64 bit

Status

Assignee

Unassigned

Reporter

panagiotis zarros

Labels

Components

Affects versions

3.2.2
3.2.3

Priority

Major
Configure